Subject
type: Class
type: NamedIndividual
type: ConceptScheme
comment: Theme represented in the illustration
label: Tema @es
subclass of: Slot
subclass of: Concept

Ontology of the Ovid Digital Library
type: Ontology
contributor: Fatima Díez-Platas https://scholar.google.es/citations?user=ffHzVkkAAAAJ&hl=es https://www.researchgate.net/profile/Fatima-Diez-Platas @es
date: 2022
description: Esta ontología modela la información con la que se cuenta en la Biblioteca Digital Ovidiana. La Biblioteca Digital Ovidiana es el resultado de una serie de proyectos de investigación del mismo título, financiados por los Ministerios de Ciencia y Tecnología, Ciencia e Innovación y Economía y Competitividad, que se llevan desarrollando en la Universidad de Santiago de Compostela desde el año 2007 La información se ha extraido del estudio pormenorizado de los ejemplares de las ediciones ilustradas de Ovido desde el siglo XV hasta el XIX y que se encuantran custodiados en biblotecas españolas, tanto públicas como privadas. En la ontología se modelan las distintas entidades, sus atributos y relaciones. Una característica importante es la integración de una serie de tesauros para representar los valores de determinadas propiedades y que se encuentran en proceso de elaboración. La ontología se encuentra en desarrollo y está siendo sometida a sucesivos refinamientos. @es
description: This ontology models the information available in the Ovidian Digital Library. The Ovidian Digital Library is the result of a series of research projects of the same title, funded by the Ministries of Science and Technology, Science and Innovation, and Economy and Competitiveness, which have been carried out at the University of Santiago de Compostela since 2007. The information has been extracted from the detailed study of the copies of the illustrated editions of Ovid from the 15th to the 19th century, which are curated in Spanish libraries, both public and private. The ontology models the different entities, their attributes and relationships. An important feature is the integration of a series of thesauri to represent the values of certain properties and which are in the process of being developed. The ontology is under development and undergoing successive refinements.
title: Ontología de la Biblioteca Digital Ovidiana @es
creator: M Luisa Díez-Platas https://orcid.org/0000-0002-9416-3147
creator: Paloma Centenera Centenera
publisher: Ovid Digital Library Projects. Principal Investigator: Fátima Díez-Platas Phase I (2007- 2010): "Ovidian digital library: illustrated editions of Ovid, 15th-19th centuries (I): the libraries of Galicia and Catalonia" (HUM2007- 60265/ARTE) Phase II (2011-2012): "Ovidian digital library: illustrated editions of Ovid, 15th-19th centuries (II): the libraries of Catalonia" (HAR2010-20015). Phase III (2012-2014): "Ovidian digital library: illustrated editions of Ovid, 15th-19th centuries (III): the libraries of Castilla y León" (HAR2011-25853). Phase IV (2015-2017): "Ovidian digital library: illustrated editions of Ovid, 15th-19th centuries (IV): the libraries of the Community of Madrid" (HAR2014-55617-P). Phase V (2018-2022): "Ovidian digital library: illustrated editions of Ovid, 15th-19th centuries (V): the libraries of the Autonomous Communities of Andalusia, Extremadura, the Canary Islands, Ceuta and Melilla" (HAR2017-86876-P). Funded by the Ministerios de Ciencia y Tecnología, Ciencia e Innovación y Economía y Competitividad. Spain.
preferred namespace prefix: bdo
imports: agentrole.owl
version info: V1.0

Edition
type: Class
comment: Concept that represents a collection of specimens that have common characteristics, such as their format, the list of illustrations and others.
label: Edición @es
subclass of: F3 Manifestation Product Type

Illustration
type: Class
comment: Illustration that appears in an edition. Contains enumeration, position and thematic description.
label: Ilustración @es
subclass of: Slot

Library Location
type: Class
comment: Location of the library by specifying the city, province and community to which it belongs. At the moment it is not necessary the pias because all the libraries are located in the Spanish territory.
label: Ubicación Biblioteca @es
subclass of: F9

Opus
type: Class
comment: Cada una de las obras contenidas en el ejemplar @es
subclass of: F1 Work
subclass of: ProvidedCHO

Specimen
type: Class
comment: Each of the physical manifestations of an edition found in the libraries referenced in the Ovid Digital Library.
label: Ejemplar @es
subclass of: F5 Item

Specimen Illustration
type: Class
comment: Illustration that appears in a specimen. The characteristics and themes of the illustration are already specified in the edition corresponding to the issue. This class reports specifically on aspects found in a specimen, such as possible censorship and others.
label: Illustration that appears in a specimen. The characteristics and themes of the illustration are already specified in the edition corresponding to the issue. This class reports specifically on aspects found in a copy, such as possible censorship and others.
subclass of: Illustration

Approximation of date if not known exactly.
type: DatatypeProperty
domain: ApproximateDate
range: string
sub property of: dateExpression

Edition Code
type: DatatypeProperty
comment: Edition representation code. The code consists of the work, followed by the name of the editor/translator/commentator of the work (if it is an annotated or translated edition), then the name of the printer, the place of printing and the date: Metamorphosis.Anguillara.Giunta.Venice.1584. corresponds to the well-known translation of the Metamorphoses by the Italian humanist Giovanni Andrea dell'Anguillara and printed in Venice in 1584 by Bernardo Giunta.
domain: Edition
label: Cödigo Edición @es
range: string
sub property of: code

Library cide
type: DatatypeProperty
comment: Library codes are represented by the acronym of their name. The acronym of the Biblioteca Xeral Universitaria de la Universidad de Santiago is BXU.
domain: Library
label: Código biblioteca @es
range: string
sub property of: code

Short code
type: DatatypeProperty
comment: Code that includes the abbreviation of the work, the name of the printer, the abbreviated place and the date (M.Benalius.Ven.[1493]). This abridged version serves to give quick and pertinent information on the purely editorial aspect, leaving aside the information on the edited text.
domain: Edition
label: Código breve @es
range: string
sub property of: code

specimenCode
type: DatatypeProperty
comment: In addition to the edition identification code, the BDO has developed a second library-specific copy identification code. The specimen is each of the actual copies in the libraries. The specimen code is composed of the abbreviation of the work, the acronym of the library, the abbreviation of the place of publication, and the date. The acronym of the Biblioteca Xeral Universitaria de la Universidad de Santiago is BXU. Thus, this incunabulum has the code M.BXU.Ven.[1493].
domain: Specimen
range: string
sub property of: code

Specimen illustration file
type: DatatypeProperty
comment: File of specimen illustration
domain: Specimen Illustration
label: Archivo imagen ilustración @es
range: anyURI
sub property of: locationOfIllustration

FRBRoo model
note: Element set of the Functional Requirements for Bibliographic Records object-oriented extension to the the CIDOC Conceptual Reference Model (CRM)

Self-Contained Expression
type: Class
comment: This class comprises the immaterial realisations of individual works at a particular time that are regarded as a complete whole. The quality of wholeness reflects the intention of its creator that this expression should convey the concept of the work. Such a whole can in turn be part of a larger whole. Inherent to the notion of work is the completion of recognisable outcomes of the work. These outcomes, i.e. the Self-Contained Expressions, are regarded as the symbolic equivalents of Individual Works, which form the atoms of a complex work. A Self-Contained Expression may contain expressions or parts of expressions from other work, such as citations or items collected in anthologies. Even though they are incorporated in the Self-Contained Expression, they are not regarded as becoming members of the expressed container work by their inclusion in the expression, but are rather regarded as foreign or referred to elements. F22 Self-Contained Expression can be distinguished from F23 Expression Fragment in that an F23 Expression Fragment was not intended by its creator to make sense by itself. Normally creators would characterise an outcome of a work as finished. In other cases, one could recognise an outcome of a work as complete from the elaboration or logical coherence of its content, or if there is any historical knowledge about the creator deliberately or accidentally never finishing (completing) that particular expression. In all those cases, one would regard an expression as self-contained.
subclass of: F2 Expression

Utilized Information Carrier
type: Class
comment: This class comprises physical objects that carry one or more instances of F24 Publication Expression.
subclass of: E84 Information Carrier

Title
type: AnnotationProperty
type: DatatypeProperty
comment: Title of the edition or specimen @es
domain: Edition
domain: Specimen
label: Título @es

E52 Time-Span
type: Class
comment: This class comprises abstract temporal extents, in the sense of Galilean physics, having a beginning, an end and a duration. Time Span has no other semantic connotations. Time-Spans are used to define the temporal extent of instances of E4 Period, E5 Event and any other phenomena valid for a certain time. An E52 Time-Span may be identified by one or more instances of E49 Time Appellation. Since our knowledge of history is imperfect, instances of E52 Time-Span can best be considered as approximations of the actual Time-Spans of temporal entities. The properties of E52 Time-Span are intended to allow these approximations to be expressed precisely. An extreme case of approximation, might, for example, define an E52 Time-Span having unknown beginning, end and duration. Used as a common E52 Time-Span for two events, it would nevertheless define them as being simultaneous, even if nothing else was known. Automatic processing and querying of instances of E52 Time-Span is facilitated if data can be parsed into an E61 Time Primitive. 1961 From 12-17-1993 to 12-8-1996 14h30 – 16h22 4th July 1945 9.30 am 1.1.1999 to 2.00 pm 1.1.1999 duration of the Ming Dynasty